{"text_format":"1","workbook":"xlsx","n_sheets":6,"sheets":["MENU","ACTUALIZACION DATOS","F1","BD1","BD-resultados","Hoja2"],"not_rendered":{"charts":2,"images":15,"macros":1,"external_links":0,"defined_names":92,"comments":0,"pivot_tables":1},"unopened":[],"bounds":{"document_bytes":16777216,"sheet_cells":100000,"rows_first":2000,"rows_last":500,"rows_between":2000,"halvings":0,"cell_chars":16384,"cell_head_chars":4096},"cells_cut":0,"cells_raw":0,"read":"whole","date_system":"1900"}

{"sheet":"MENU","index":0,"n_rows":24,"n_cols":19,"rows_kept":24,"cut":false,"hidden":false,"merged":[[23,0,23,16383],[1,0,1,16383],[4,0,4,16383],[2,0,2,19],[3,0,3,16383],[10,0,10,16383]]}
[]
["Sistema para el reporte de información por parte de "]
["los Jefes de Control Interno al Alcalde Mayor"]
[]
["MENU PRINCIPAL"]
[]
[]
[]
{"$rows_left_out":17}
{"sheet":"ACTUALIZACION DATOS","index":1,"n_rows":32,"n_cols":17,"rows_kept":32,"cut":false,"hidden":false,"merged":[[31,0,31,16383],[20,16,20,17],[1,0,1,16383],[2,0,2,19],[3,0,3,16383],[4,0,4,16383],[26,10,26,13],[26,3,26,8],[15,3,16,8],[11,10,11,17],[9,10,9,17],[13,10,13,17],[15,10,16,17],[13,3,13,8],[11,3,11,8],[9,3,9,8],[24,10,24,13],[24,16,24,17],[18,10,18,13],[18,16,18,17],[24,3,24,8],[22,10,22,17],[18,3,18,8],[22,3,22,8]]}
[]
["Sistema para el reporte de información por parte de "]
["los Jefes de Control Interno al Alcalde Mayor"]
[]
[]
[]
[]
[]
{"$rows_left_out":25}
{"sheet":"F1","index":2,"n_rows":1265,"n_cols":21,"rows_kept":1265,"cut":false,"hidden":false,"merged":[[1242,3,1245,3],[1248,3,1251,3],[1254,3,1257,3],[1264,1,1264,22],[1040,3,1043,3],[1046,3,1049,3],[1052,3,1055,3],[1058,3,1061,3],[1064,3,1067,3],[1070,3,1073,3],[1076,3,1079,3],[1152,3,1155,3],[1158,3,1161,3],[1164,3,1167,3],[1170,3,1173,3],[1176,3,1179,3],[1182,3,1185,3],[1188,3,1191,3],[1194,3,1197,3],[1200,3,1203,3],[1114,5,1115,5],[1116,4,1117,4],[1116,5,1117,5],[1118,4,1119,4],[1118,5,1119,5],[1120,4,1121,4],[1120,5,1121,5],[1142,4,1143,4],[1142,5,1143,5],[1144,4,1145,4],[1144,5,1145,5],[1146,4,1147,4],[614,3,617,3],[446,3,449,3],[452,3,455,3],[458,3,461,3],[464,3,467,3],[470,3,473,3],[476,3,479,3],[482,3,485,3],[488,3,491,3],[494,3,497,3],[500,3,503,3],[506,3,509,3],[512,3,515,3],[518,3,521,3],[524,3,527,3],[530,3,533,3],[536,3,539,3],[141,3,144,3],[147,3,150,3],[153,3,156,3],[159,3,162,3],[165,3,168,3],[171,3,174,3],[177,3,180,3],[87,2,90,2],[93,2,96,2],[99,2,102,2],[105,2,108,2],[111,2,114,2],[117,2,120,2],[123,2,126,2],[129,2,132,2],[135,2,138,2],[141,2,144,2],[147,2,150,2],[153,2,156,2],[159,2,162,2],[165,2,168,2],[171,2,174,2],[177,2,180,2],[75,3,78,3],[81,3,84,3],[87,3,90,3],[93,3,96,3],[99,3,102,3],[105,3,108,3],[111,3,114,3],[117,3,120,3],[123,3,126,3],[129,3,132,3],[135,3,138,3],[1148,4,1149,4],[1148,5,1149,5],[1126,4,1127,4],[1126,5,1127,5],[1128,4,1129,4],[1128,5,1129,5],[1130,4,1131,4],[1130,5,1131,5],[1132,4,1133,4],[1132,5,1133,5],[1134,4,1135,4],[1134,5,1135,5],[1136,4,1137,4],[1136,5,1137,5],[1140,4,1141,4],[1140,5,1141,5],[1110,4,1111,4],[1110,5,1111,5],[1112,4,1113,4],[1112,5,1113,5],[1114,4,1115,4],[1146,5,1147,5],[1094,4,1095,4],[1094,5,1095,5],[1096,4,1097,4],[1096,5,1097,5],[1098,4,1099,4],[1098,5,1099,5],[1100,4,1101,4],[1100,5,1101,5],[1102,4,1103,4],[1102,5,1103,5],[1104,4,1105,4],[1104,5,1105,5],[1094,2,1095,2],[1094,3,1095,3],[1096,2,1097,2],[1096,3,1097,3],[1098,2,1099,2],[1098,3,1099,3],[1100,2,1101,2],[1100,3,1101,3],[1102,2,1103,2],[1102,3,1103,3],[1104,2,1105,2],[1104,3,1105,3],[1108,4,1109,4],[1108,5,1109,5],[1122,4,1123,4],[1122,5,1123,5],[1124,4,1125,4],[1124,5,1125,5],[1138,4,1139,4],[424,4,425,4],[424,5,425,5],[426,4,427,4],[426,5,427,5],[428,4,429,4],[428,5,429,5],[1086,4,1087,4],[1086,5,1087,5],[1088,4,1089,4],[1088,5,1089,5],[440,2,443,2],[440,5,440,7],[452,2,455,2],[452,5,452,7],[461,4,461,10],[488,2,491,2],[488,5,488,7],[488,9,488,16],[497,11,497,20],[512,2,515,2],[512,5,512,7],[512,9,512,16],[512,17,512,18],[512,19,512,20],[514,4,514,10],[424,9,425,9],[424,10,425,10],[424,14,425,14],[424,15,425,15],[424,19,425,19],[424,20,425,20],[426,9,427,9],[412,4,413,4],[412,5,413,5],[414,4,415,4],[414,5,415,5],[416,4,417,4],[416,5,417,5],[422,4,423,4],[422,5,423,5],[418,4,419,4],[418,5,419,5],[420,4,421,4],[420,5,421,5],[410,2,411,2],[410,3,411,3],[412,2,413,2],[412,3,413,3],[414,2,415,2],[414,3,415,3],[416,2,417,2],[416,3,417,3],[418,2,419,2],[418,3,419,3],[420,2,421,2],[410,4,411,4],[410,5,411,5],[420,3,421,3],[422,2,423,2],[422,3,423,3],[396,4,397,4],[396,5,397,5],[398,4,399,4],[398,5,399,5],[400,4,401,4],[400,5,401,5],[406,5,407,5],[408,4,409,4],[408,5,409,5],[396,2,397,2],[396,3,397,3],[398,2,399,2],[398,3,399,3],[408,2,409,2],[408,3,409,3],[406,2,407,2],[406,3,407,3],[406,4,407,4],[368,4,369,4],[368,5,369,5],[370,4,371,4],[370,5,371,5],[372,4,373,4],[372,5,373,5],[374,4,375,4],[374,5,375,5],[376,4,377,4],[376,5,377,5],[368,2,369,2],[368,3,369,3],[370,2,371,2],[370,3,371,3],[372,2,373,2],[372,3,373,3],[374,2,375,2],[374,3,375,3],[376,2,377,2],[376,3,377,3],[5,5,5,12],[370,14,371,14],[370,15,371,15],[370,19,371,19],[370,20,371,20],[378,9,379,9],[378,10,379,10],[378,14,379,14],[378,15,379,15],[378,19,379,19],[378,20,379,20],[372,9,373,9],[372,10,373,10],[372,14,373,14],[171,5,171,7],[171,9,171,16],[171,17,171,18],[171,19,171,20],[173,4,173,10],[173,11,173,20],[174,4,174,10],[174,11,174,20],[177,5,177,7],[177,9,177,16],[177,17,177,18],[177,19,177,20],[179,4,179,10],[179,11,179,20],[180,4,180,10],[366,4,367,4],[180,11,180,20],[159,5,159,7],[159,9,159,16],[159,17,159,18],[159,19,159,20],[161,4,161,10],[161,11,161,20],[162,4,162,10],[162,11,162,20],[165,5,165,7],[165,9,165,16],[165,17,165,18],[165,19,165,20],[167,4,167,10],[167,11,167,20],[168,4,168,10],[168,11,168,20],[147,5,147,7],[147,9,147,16],[147,17,147,18],[147,19,147,20],[149,4,149,10],[149,11,149,20],[150,4,150,10],[150,11,150,20],[153,5,153,7],[153,9,153,16],[153,17,153,18],[153,19,153,20],[155,4,155,10],[155,11,155,20],[156,4,156,10],[156,11,156,20],[135,5,135,7],[135,9,135,16],[135,17,135,18],[135,19,135,20],[137,4,137,10],[137,11,137,20],[138,4,138,10],[138,11,138,20],[141,5,141,7],[141,9,141,16],[141,17,141,18],[141,19,141,20],[143,4,143,10],[143,11,143,20],[144,4,144,10],[144,11,144,20],[123,5,123,7],[123,9,123,16],[123,17,123,18],[123,19,123,20],[125,4,125,10],[125,11,125,20],[126,4,126,10],[126,11,126,20],[129,5,129,7],[129,9,129,16],[129,17,129,18],[129,19,129,20],[131,4,131,10],[131,11,131,20],[132,4,132,10],[132,11,132,20],[111,5,111,7],[111,9,111,16],[111,17,111,18],[111,19,111,20],[113,4,113,10],[113,11,113,20],[114,4,114,10],[114,11,114,20],[117,5,117,7],[117,9,117,16],[117,17,117,18],[117,19,117,20],[119,4,119,10],[119,11,119,20],[120,4,120,10],[120,11,120,20],[93,5,93,7],[93,9,93,16],[93,17,93,18],[93,19,93,20],[95,4,95,10],[95,11,95,20],[96,4,96,10],[96,11,96,20],[99,5,99,7],[99,9,99,16],[99,17,99,18],[99,19,99,20],[101,4,101,10],[101,11,101,20],[102,4,102,10],[102,11,102,20],[105,5,105,7],[105,9,105,16],[105,17,105,18],[105,19,105,20],[107,4,107,10],[107,11,107,20],[108,4,108,10],[108,11,108,20],[87,5,87,7],[87,9,87,16],[87,17,87,18],[87,19,87,20],[89,4,89,10],[89,11,89,20],[90,4,90,10],[90,11,90,20],[68,19,69,19],[68,20,69,20],[66,9,67,9],[66,10,67,10],[66,14,67,14],[66,15,67,15],[70,19,71,19],[70,20,71,20],[58,9,59,9],[58,10,59,10],[58,14,59,14],[58,15,59,15],[58,19,59,19],[58,20,59,20],[70,9,71,9],[70,10,71,10],[64,20,65,20],[62,9,63,9],[62,10,63,10],[62,14,63,14],[62,15,63,15],[60,10,61,10],[60,14,61,14],[60,15,61,15],[60,19,61,19],[60,20,61,20],[12,19,13,19],[24,9,25,9],[24,10,25,10],[24,14,25,14],[24,15,25,15],[30,9,31,9],[30,10,31,10],[30,14,31,14],[30,15,31,15],[30,19,31,19],[26,4,27,4],[26,5,27,5],[30,20,31,20],[28,9,29,9],[28,10,29,10],[28,14,29,14],[28,15,29,15],[20,19,21,19],[20,20,21,20],[22,9,23,9],[22,10,23,10],[22,14,23,14],[22,15,23,15],[22,19,23,19],[22,20,23,20],[20,9,21,9],[20,10,21,10],[20,14,21,14],[24,19,25,19],[24,20,25,20],[26,9,27,9],[26,10,27,10],[16,20,17,20],[18,9,19,9],[18,10,19,10],[18,14,19,14],[18,15,19,15],[18,19,19,19],[18,20,19,20],[16,9,17,9],[16,10,17,10],[16,14,17,14],[16,15,17,15],[18,4,19,4],[18,5,19,5],[20,4,21,4],[20,5,21,5],[20,15,21,15],[22,4,23,4],[22,5,23,5],[24,4,25,4],[24,5,25,5],[26,14,27,14],[26,15,27,15],[26,19,27,19],[26,20,27,20],[28,19,29,19],[28,20,29,20],[48,15,49,15],[50,10,51,10],[50,14,51,14],[48,19,49,19],[48,20,49,20],[70,14,71,14],[70,15,71,15],[66,19,67,19],[66,20,67,20],[68,9,69,9],[68,10,69,10],[68,14,69,14],[68,15,69,15],[52,19,53,19],[52,20,53,20],[54,9,55,9],[54,10,55,10],[54,14,55,14],[54,15,55,15],[54,19,55,19],[54,20,55,20],[52,9,53,9],[52,10,53,10],[52,14,53,14],[52,15,53,15],[56,19,57,19],[56,20,57,20],[64,9,65,9],[64,10,65,10],[64,14,65,14],[64,15,65,15],[64,19,65,19],[42,4,43,4],[42,5,43,5],[42,14,43,14],[42,15,43,15],[42,19,43,19],[42,20,43,20],[38,9,39,9],[38,10,39,10],[38,14,39,14],[38,15,39,15],[38,19,39,19],[38,20,39,20],[44,4,45,4],[44,5,45,5],[62,19,63,19],[62,20,63,20],[56,9,57,9],[56,10,57,10],[56,14,57,14],[56,15,57,15],[50,15,51,15],[50,19,51,19],[50,20,51,20],[60,9,61,9],[48,9,49,9],[48,10,49,10],[48,14,49,14],[40,19,41,19],[40,20,41,20],[83,4,83,10],[83,11,83,20],[84,4,84,10],[84,11,84,20],[10,9,11,9],[10,10,11,10],[10,14,11,14],[10,15,11,15],[40,9,41,9],[40,10,41,10],[40,14,41,14],[40,15,41,15],[46,19,47,19],[46,20,47,20],[44,9,45,9],[44,10,45,10],[44,14,45,14],[44,15,45,15],[44,19,45,19],[44,20,45,20],[46,9,47,9],[46,10,47,10],[46,14,47,14],[46,15,47,15],[32,19,33,19],[32,20,33,20],[42,9,43,9],[50,9,51,9],[38,4,39,4],[38,5,39,5],[81,5,81,7],[81,9,81,16],[81,17,81,18],[81,19,81,20],[0,0,0,23],[75,2,78,2],[75,5,75,7],[75,9,75,16],[75,17,75,18],[75,19,75,20],[74,2,74,21],[78,4,78,10],[78,11,78,20],[77,4,77,10],[77,11,77,20],[8,7,8,10],[9,9,9,10],[8,12,8,15],[9,14,9,15],[2,2,2,3],[6,2,6,3],[9,12,9,13],[9,17,9,18],[9,7,9,8],[8,17,8,20],[9,19,9,20],[2,4,2,8],[10,19,11,19],[10,20,11,20],[42,10,43,10],[6,4,6,8],[6,10,6,13],[6,14,6,21],[2,10,2,12],[2,15,2,18],[2,19,2,21],[36,19,37,19],[36,20,37,20],[34,9,35,9],[34,10,35,10],[34,14,35,14],[34,15,35,15],[34,19,35,19],[34,20,35,20],[36,9,37,9],[36,10,37,10],[36,14,37,14],[36,15,37,15],[32,9,33,9],[32,10,33,10],[32,14,33,14],[32,15,33,15],[12,20,13,20],[14,9,15,9],[14,10,15,10],[14,14,15,14],[14,15,15,15],[14,19,15,19],[14,20,15,20],[12,9,13,9],[12,10,13,10],[12,14,13,14],[12,15,13,15],[16,19,17,19],[364,4,364,8],[364,10,364,13],[364,14,364,21],[366,7,366,10],[366,12,366,15],[366,17,366,20],[367,7,367,8],[367,9,367,10],[367,12,367,13],[367,14,367,15],[367,17,367,18],[367,19,367,20],[366,5,367,5],[70,4,71,4],[70,5,71,5],[54,4,55,4],[54,5,55,5],[56,4,57,4],[56,5,57,5],[58,4,59,4],[58,5,59,5],[60,4,61,4],[60,5,61,5],[62,4,63,4],[62,5,63,5],[28,4,29,4],[28,5,29,5],[185,4,185,8],[185,10,185,13],[376,9,377,9],[376,10,377,10],[376,14,377,14],[376,15,377,15],[376,19,377,19],[376,20,377,20],[368,9,369,9],[368,10,369,10],[368,14,369,14],[368,15,369,15],[368,19,369,19],[368,20,369,20],[370,9,371,9],[370,10,371,10],[372,15,373,15],[372,19,373,19],[372,20,373,20],[374,9,375,9],[374,10,375,10],[374,14,375,14],[374,15,375,15],[374,19,375,19],[374,20,375,20],[378,4,379,4],[378,5,379,5],[380,4,381,4],[380,5,381,5],[382,4,383,4],[382,5,383,5],[384,4,385,4],[384,5,385,5],[390,9,391,9],[390,10,391,10],[390,14,391,14],[390,15,391,15],[390,19,391,19],[390,20,391,20],[388,4,389,4],[388,5,389,5],[386,9,387,9],[386,10,387,10],[386,14,387,14],[386,15,387,15],[386,19,387,19],[386,20,387,20],[390,4,391,4],[390,5,391,5],[380,9,381,9],[380,10,381,10],[380,14,381,14],[380,15,381,15],[380,19,381,19],[380,20,381,20],[382,9,383,9],[382,10,383,10],[382,14,383,14],[382,15,383,15],[382,19,383,19],[382,20,383,20],[396,9,397,9],[396,10,397,10],[396,14,397,14],[396,15,397,15],[396,19,397,19],[396,20,397,20],[398,9,399,9],[398,10,399,10],[398,14,399,14],[398,15,399,15],[398,19,399,19],[398,20,399,20],[384,9,385,9],[384,10,385,10],[384,14,385,14],[384,15,385,15],[384,19,385,19],[384,20,385,20],[386,4,387,4],[386,5,387,5],[392,9,393,9],[392,10,393,10],[392,14,393,14],[392,15,393,15],[392,19,393,19],[392,20,393,20],[394,9,395,9],[394,10,395,10],[394,14,395,14],[394,15,395,15],[394,19,395,19],[394,20,395,20],[388,9,389,9],[388,10,389,10],[388,14,389,14],[388,15,389,15],[388,19,389,19],[388,20,389,20],[392,4,393,4],[392,5,393,5],[394,4,395,4],[394,5,395,5],[400,9,401,9],[400,10,401,10],[400,14,401,14],[400,15,401,15],[400,19,401,19],[400,20,401,20],[402,9,403,9],[402,10,403,10],[402,14,403,14],[402,15,403,15],[402,19,403,19],[402,20,403,20],[400,2,401,2],[400,3,401,3],[402,2,403,2],[402,3,403,3],[404,2,405,2],[404,3,405,3],[402,4,403,4],[402,5,403,5],[404,4,405,4],[404,5,405,5],[408,9,409,9],[408,10,409,10],[408,14,409,14],[408,15,409,15],[408,19,409,19],[408,20,409,20],[410,9,411,9],[410,10,411,10],[410,14,411,14],[410,15,411,15],[410,19,411,19],[410,20,411,20],[404,9,405,9],[404,10,405,10],[404,14,405,14],[404,15,405,15],[404,19,405,19],[404,20,405,20],[406,9,407,9],[406,10,407,10],[406,14,407,14],[406,15,407,15],[406,19,407,19],[406,20,407,20],[416,9,417,9],[416,10,417,10],[416,14,417,14],[416,15,417,15],[416,19,417,19],[416,20,417,20],[418,9,419,9],[418,10,419,10],[418,14,419,14],[418,15,419,15],[418,19,419,19],[418,20,419,20],[412,9,413,9],[412,10,413,10],[412,14,413,14],[412,15,413,15],[412,19,413,19],[412,20,413,20],[414,9,415,9],[414,10,415,10],[414,14,415,14],[414,15,415,15],[414,19,415,19],[414,20,415,20],[426,10,427,10],[426,14,427,14],[426,15,427,15],[426,19,427,19],[426,20,427,20],[420,9,421,9],[420,10,421,10],[420,14,421,14],[420,15,421,15],[420,19,421,19],[420,20,421,20],[422,9,423,9],[422,10,423,10],[422,14,423,14],[422,15,423,15],[422,19,423,19],[422,20,423,20],[440,9,440,16],[440,17,440,18],[440,19,440,20],[442,4,442,10],[442,11,442,20],[443,4,443,10],[443,11,443,20],[428,9,429,9],[428,10,429,10],[428,14,429,14],[428,15,429,15],[428,19,429,19],[428,20,429,20],[433,2,433,21],[434,2,437,2],[434,5,434,7],[434,9,434,16],[434,17,434,18],[434,19,434,20],[436,4,436,10],[436,11,436,20],[437,4,437,10],[437,11,437,20],[434,3,437,3],[440,3,443,3],[452,9,452,16],[452,17,452,18],[452,19,452,20],[454,4,454,10],[454,11,454,20],[455,4,455,10],[455,11,455,20],[446,2,449,2],[446,5,446,7],[446,9,446,16],[446,17,446,18],[446,19,446,20],[448,4,448,10],[448,11,448,20],[449,4,449,10],[449,11,449,20],[464,2,467,2],[464,5,464,7],[464,9,464,16],[464,17,464,18],[464,19,464,20],[466,4,466,10],[466,11,466,20],[467,4,467,10],[467,11,467,20],[458,2,461,2],[458,5,458,7],[458,9,458,16],[458,17,458,18],[458,19,458,20],[460,4,460,10],[460,11,460,20],[461,11,461,20],[476,2,479,2],[476,5,476,7],[476,9,476,16],[476,17,476,18],[476,19,476,20],[478,4,478,10],[478,11,478,20],[479,4,479,10],[479,11,479,20],[470,2,473,2],[470,5,470,7],[470,9,470,16],[470,17,470,18],[470,19,470,20],[472,4,472,10],[472,11,472,20],[473,4,473,10],[473,11,473,20],[488,17,488,18],[488,19,488,20],[490,4,490,10],[490,11,490,20],[491,4,491,10],[491,11,491,20],[482,2,485,2],[482,5,482,7],[482,9,482,16],[482,17,482,18],[482,19,482,20],[484,4,484,10],[484,11,484,20],[485,4,485,10],[485,11,485,20],[500,2,503,2],[500,5,500,7],[500,9,500,16],[500,17,500,18],[500,19,500,20],[502,4,502,10],[502,11,502,20],[503,4,503,10],[503,11,503,20],[494,2,497,2],[494,5,494,7],[494,9,494,16],[494,17,494,18],[494,19,494,20],[496,4,496,10],[496,11,496,20],[497,4,497,10],[514,11,514,20],[515,4,515,10],[515,11,515,20],[506,2,509,2],[506,5,506,7],[506,9,506,16],[506,17,506,18],[506,19,506,20],[508,4,508,10],[508,11,508,20],[509,4,509,10],[509,11,509,20],[524,2,527,2],[524,5,524,7],[524,9,524,16],[524,17,524,18],[524,19,524,20],[526,4,526,10],[526,11,526,20],[527,4,527,10],[527,11,527,20],[518,2,521,2],[518,5,518,7],[518,9,518,16],[518,17,518,18],[518,19,518,20],[520,4,520,10],[520,11,520,20],[521,4,521,10],[521,11,521,20],[536,5,536,7],[536,9,536,16],[536,17,536,18],[536,19,536,20],[538,4,538,10],[538,11,538,20],[539,4,539,10],[539,11,539,20],[530,2,533,2],[530,5,530,7],[530,9,530,16],[530,17,530,18],[530,19,530,20],[532,4,532,10],[532,11,532,20],[533,4,533,10],[533,11,533,20],[1088,9,1089,9],[1088,10,1089,10],[1088,14,1089,14],[1088,15,1089,15],[1088,19,1089,19],[1088,20,1089,20],[1090,9,1091,9],[1090,10,1091,10],[1090,14,1091,14],[1090,15,1091,15],[1090,19,1091,19],[1090,20,1091,20]],"merged_total":3567,"flags":["merged_cut"]}
[]
[]
[null,null,"ENTIDAD",null,{"$f":"MENU!S9","v":"Transmilenio S.A."},null,null,null,null,null,"VIGENCIA",null,null,2017,null,"PERIODO REPORTADO",null,null,null,"30 DE JUNIO"]
[]
[]
[]
[null,null,"PILAR_2",null,{"$f":"IF(ISERROR(INDEX('BD1'!$B$56:$H$56,1,MATCH(C7,'BD1'!$B$55:$H$55,0))),\"\",(INDEX('BD1'!$B$56:$H$56,1,MATCH(C7,'BD1'!$B$55:$H$55,0))))","v":"Democracia Urbana"}]
[]
{"$rows_left_out":1258}
{"sheet":"BD1","index":3,"n_rows":261,"n_cols":40,"rows_kept":261,"cut":false,"hidden":true,"merged":[[0,3,0,15],[1,33,1,36],[53,9,53,11],[53,13,53,15],[10,34,10,36],[10,33,11,33],[53,1,53,7],[0,18,0,31],[83,0,106,0],[111,0,138,0],[23,33,23,38],[32,33,32,38],[73,4,73,6],[219,1,219,4],[218,1,218,4],[78,1,78,14],[141,1,141,7],[140,1,140,7],[165,1,165,6],[109,1,109,9],[108,1,108,9],[80,1,80,14],[81,1,81,14],[192,1,192,6],[166,1,166,6],[174,1,174,8],[175,1,175,8],[191,1,191,6]]}
[null,null,null,"Sector Administrativo",null,null,null,null,null,null,null,null,null,null,null,null,null,null,"Nivel"]
[null,null,null,"Gestión_Pública","Gobierno_Seguridad_y_Convivencia","Hacienda","Planeación","Desarrollo_Económico_Industria_y_Turismo","Educación","Salud","Integración_Social","Cultura_Recreación_y_Deporte","Ambiente","Movilidad","Hábitat","Mujer","Gestión_Juridica",null,"Gestión_Pública","Gobierno_Seguridad_y_Convivencia","Hacienda","Planeación","Desarrollo_Económico_Industria_y_Turismo","Educación","Salud","Integración_Social","Cultura_Recreación_y_Deporte","Ambiente","Movilidad","Hábitat","Mujer","Gestión_Juridica",null,"PERIODOS INFORMES",null,null,null,null,"ORIGEN DEL INFORME","TIPO DE EVALUACIÓN "]
[null,null,null,null,null,null,null,null,null,null,null,null,null,null,null,null,null,null,null,null,null,null,null,null,null,null,null,null,null,null,null,null,null,"RELACION DE CAUSAS"]
[null,null,null,"Secretaría General ","Secretaría Distrital de Gobierno  ","Secretaría Distrital de Hacienda ","Secretaría Distrital de Planeación\n ","Secretaría Distrital de Desarrollo Económico","Secretaría Distrital de Educación","Secretaría Distrital de Salud\n ","Secretaría Distrital de Integración Social","Secretaría Distrital de Cultura, Recreación y Deporte","Secretaría Distrital de Ambiente","Secretaría Distrital de Movilidad","Secretaría Distrital de Hábitat","Secretaría Distrital de la Mujer","Secretaría Distrital de Asuntos Juridicos",null,"Central","Central","Central","Central","Central","Central","Central","Central","Central","Central","Central","Central","Central","Central",null,"30 DE JUNIO",null,null,null,null,"LEGAL ","CALIDAD"]
[null,null,null,"Departamento Administrativo del Servicio Civil ","Depto. Adtivo de la Defensoría del Espacio Público","U.A.E. Unidad Adtiva Especial de Catastro",null,"Instituto para la Economía Social","Inst. para la Invest. y el Desarrollo Pedagógico","Fondo Financiero Distrital de Salud ","Instituto para la Protección de la Niñez y la Juventud","Inst. Dist. para la Recreación y el Deporte","Jardín Botánico José Celestino Mutis","Instituto de Desarrollo Urbano","Unidad Adtiva Especial de Servicios Públicos",null,null,null,"Central","Central","Descentralizada / Adscrita",null,"Descentralizada / Adscrita","Descentralizada / Adscrita","Descentralizada / Adscrita","Descentralizada / Adscrita","Descentralizada / Adscrita","Descentralizada / Adscrita","Descentralizada / Adscrita","Descentralizada / Adscrita",null,null,null,"31 DE DICIEMBRE",null,null,null,null,"PROGRAMA ANUAL DE AUDITORÍAS ","CONTROL INTERNO"]
[null,null,null,null,"UAE Cuerpo Oficial de Bomberos","Fondo de Prestaciones Económ, Cesantías y Pensiones",null,"Instituto Distrital de Turismo","Universidad Distrital Francisco José de Caldas ","Capital Salud",null,"Fundación Gilberto Alzate Avendaño","Instituto Distrital de Gestion de Riesgo y Cambio Climatico","Unidad Adtiva, Especial de Rehabilitación y Mantenimiento Vial","Caja de Vivienda Popular",null,null,null,"Central","Central","Descentralizada / Adscrita",null,"Descentralizada / Adscrita","Descentralizada / Vinculada","Descentralizada / Vinculada",null,"Central",null,"Descentralizada / Adscrita","Descentralizada / Adscrita",null,null,null,"31 DE MARZO",null,null,null,null,"SOLICITUD ALTA DIRECCIÓN ","CONTROL INTERNO CONTABLE"]
[null,null,null,null,"Instit. Dist. de la Participación y Acción Comunal","Lotería de Bogotá  ",null,"Corpor. para el Desarrollo y la Productividad - Bogotá Región",null,"Hospital de Fontibón",null,"Inst. Dist. de Patrimonio Cultural",null,"Transmilenio S.A.","Empresa de Renovación y desarrollo Urbano",null,null,null,null,"Descentralizada / Adscrita","Descentralizada / Vinculada",null,"Descentralizada / Vinculada",null,"Descentralizada / Adscrita",null,"Descentralizada / Adscrita",null,"Descentralizada / Vinculada","Descentralizada / Vinculada",null,null,null,"30 DE SEPTIEMBRE",null,null,null,null,"OTRO","EVALUACIÓN DE GESTIÓN Y RESULTADOS"]
[null,null,null,null,null,null,null,null,null," Hospital Centro Oriente",null,"Orquesta Filarmónica de Bogotá ",null,"Terminal de Transportes S.A.","Empresa de Acueducto y Alcantarillado de Bogotá",null,null,null,null,"Descentralizada / Adscrita",null,null,null,null,"Descentralizada / Adscrita",null,"Descentralizada / Adscrita",null,"Descentralizada / Vinculada","Descentralizada / Vinculada",null,null,null,null,null,null,null,null,null,"AUDITORIA INTERNA CONTABLE "]
{"$rows_left_out":254}
{"sheet":"BD-resultados","index":4,"n_rows":428,"n_cols":28,"rows_kept":428,"cut":false,"hidden":true,"merged":[[7,25,7,27],[1,0,1,9],[7,17,7,23],[297,0,297,15],[298,11,298,13],[298,14,298,15],[7,0,7,11],[263,0,263,10]]}
[]
["DATOS JEFE DE CONTROL INTERNO"]
["SECTOR ADMITIVO","NIVEL ","ENTIDAD","NOMBRE","VACANTE",{"$f":"+'ACTUALIZACION DATOS'!P21","v":"En Encargo "},"CORREO ELECTRONICO","TELEFONO ","EXTENSIÓN ","CELUALR"]
[]
[]
[]
[]
["CUMPLIMIENTO DE LAS METAS DEL PLAN DE DESARROLLO",null,null,null,null,null,null,null,null,null,null,null,null,null,null,null,null,"RELACIÓN DE CAUSAS",null,null,null,null,null,null,null,"GESTIÓN TOTAL PROMEDIO"]
{"$rows_left_out":421}
{"sheet":"Hoja2","index":5,"n_rows":27,"n_cols":15,"rows_kept":27,"cut":false,"hidden":true,"merged":[[1,4,1,12],[6,2,15,2],[18,1,18,2],[18,5,18,6],[18,9,18,10],[3,15,3,16],[3,17,3,18],[3,19,3,20],[5,3,5,4],[5,7,5,8],[5,11,5,12],[18,13,18,14],[3,3,3,4],[3,7,3,8],[3,11,3,12],[3,13,3,14]]}
[]
[null,null,null,null,"PLAN DE DESARROLLO BOGOTA MEJOR PARA TODOS"]
[]
[]
[]
[null,null,null,"PILAR 1",null,null,null,"PILAR 2",null,null,null,"PILAR 3"]
[null,null,"Programas","3.1.1",0.8,null,null,"3.2.1",0.8,null,null,"3.3.1",0.8]
[null,null,null,"3.1.2",0.6,null,null,"3.2.2",0.6,null,null,"3.3.2.",0.6]
{"$rows_left_out":19}